{"text_format":"1","workbook":"xlsx","n_sheets":4,"sheets":["Project Information","SBUH Model","SCS,SBUH Equations","Lookups, Constants"],"not_rendered":{"charts":0,"images":1,"macros":1,"external_links":0,"defined_names":21,"comments":0,"pivot_tables":0},"unopened":[],"bounds":{"document_bytes":16777216,"sheet_cells":100000,"rows_first":2000,"rows_last":500,"rows_between":2000,"halvings":0,"cell_chars":16384,"cell_head_chars":4096},"cells_cut":0,"cells_raw":0,"read":"whole","date_system":"1900"}

{"sheet":"Project Information","index":0,"n_rows":44,"n_cols":14,"rows_kept":44,"cut":false,"hidden":false,"merged":[[29,0,29,1],[18,0,18,1],[42,0,42,1],[43,0,43,1],[38,0,38,1],[37,0,37,1],[36,0,36,1],[30,0,30,1],[28,0,28,1],[41,0,41,1],[6,2,6,3],[7,2,7,3],[20,0,20,1],[19,0,19,1],[17,0,17,1]]}
[null,"Central Coast Region"]
[null,"Stormwater Control Measure"]
[null,"Sizing Calculator",null,null,null,null,"Version: 2/26/2014"]
[]
[]
[null,"1. Project Information",null,null,null,null,null,null,null,null,null,null,"Ranges","Row"]
[null,"Project name: ",null,null,null,null,null,null,null,null,null,null,"DMA-UL",{"$f":"ROW(start_DMA)+1","v":19}]
[null,"Project location: ",null,null,null,null,null,null,null,null,null,null,"DMA-LR",{"$f":"ROW(end_DMA)-1","v":19}]
[null,"Tier 2/Tier 3: ",null,"Tier 3 - Retention",null,null,null,null,null,null,null,null,"SCM-UL",{"$f":"ROW(start_SCM)+1","v":30}]
[null,"Design rainfall depth (in): ",null,2,null,null,null,null,null,null,null,null,"SCM-LR",{"$f":"ROW(end_SCM)-1","v":30}]
[null,"Total project area (ft2): ",null,null,null,null,null,null,null,null,null,null,"OUT-UL",{"$f":"ROW(start_Output)+1","v":38}]
[null,"Total new impervious area (ft2): ",null,null,null,null,null,null,null,null,null,null,"OUT-LR",{"$f":"ROW(end_Output)-1","v":38}]
[null,"Total replaced impervious in a USA (ft2): "]
[null,"Total replaced impervious not in a USA (ft2): "]
[null,"Total pervious/landscape area (ft2): "]
[]
[null,"2. DMA Characterization"]
["Name",null,"DMA Type","Area (ft2)","Surface Type","New, Replaced?","Connection","CN","SCM CODE (DMA_CN_Weight)"]
[null,null,null,null,null,null,null,{"$f":"IF(E19=\"\",\"\",VLOOKUP(E19,'Lookups, Constants'!$A$14:$B$23,2,FALSE))","v":""},{"$f":"IF(H19=\"\",\"\",IF(H19=98,G19 & \"_\" & VLOOKUP(C19,'Lookups, Constants'!$A$4:$B$7,2,FALSE)&\"_\"&VLOOKUP(F19,'Lookups, Constants'!$A$43:$B$45,2,FALSE),G19 & \"_\" & H19))","v":""}]
["end_DMA"]
["DMA Summary Area Check"]
[null,"Total project impervious area (ft2): ",null,{"$f":"SUMIF($H$19:H20,'Lookups, Constants'!$B$14,$D$19:D20)","v":0}]
[null,"New impervious area (ft2): ",null,{"$f":"SUM(IF($H$19:H20=98,IF($F$19:F20=\"New\",$D$19:D20,\"\"),\"\"))","v":0}]
[null,"Replaced impervious within a USA (ft2): ",null,{"$f":"SUM(IF($H$19:H20=98,IF($F$19:F20=\"Replaced within a USA\",$D$19:D20,\"\"),\"\"))","v":0}]
[null,"Replaced impervious not in a USA (ft2): ",null,{"$f":"SUM(IF($H$19:H20=98,IF($F$19:F20=\"Replaced\",$D$19:D20,\"\"),\"\"))","v":0}]
[null,"Total pervious/landscape area (ft2): ",null,{"$f":"SUMIF($H$19:H20,\"<98\",$D$19:D20)","v":0}]
[null,null,null,null,null,null,null,null,"_2SCM_NEW","_2SCM_RUSA","_2SCM_RPL","_68","_89"]
[null,"3. SCM Characterization",null,null,null,null,null,null,"New Imp Area","Rpl Imp USA","Rpl Imp non-USA","Landscape","Solid unit pavers","SUM"]
["Name",null,"SCM Type","Safety Factor","SCM Soil Type","Infilt. Rate (in/hr)","Area (ft2)"]
[null,null,null,{"$f":"IF(C30=\"\",\"\",IF(C30=\"Bioretention\",1,2))","v":""},null,null,null,{"$f":"IF(A30=\"\",\"\",A30)","v":""},{"$f":"IF(H30=\"\",\"\",SUMIF($I$19:$I$20,$A30 & I$27,$D$19:$D$20))","v":""},{"$f":"IF(H30=\"\",\"\",SUMIF($I$19:$I$20,$A30 & J$27,$D$19:$D$20))","v":""},{"$f":"IF(H30=\"\",\"\",SUMIF($I$19:$I$20,$A30 & K$27,$D$19:$D$20))","v":""},{"$f":"IF(H30=\"\",\"\",SUMIF($I$19:$I$20,$A30 & L$27,$D$19:$D$20))","v":""},{"$f":"IF(H30=\"\",\"\",SUMIF($I$19:$I$20,$A30 & M$27,$D$19:$D$20))","v":""},{"$f":"SUM(I30:M30)","v":0}]
["end_SCM",null,null,null,null,null,null,null,{"$f":"IF(H31=\"\",\"\",SUMIF($I$19:$I$20,$A31 & I$27,$D$19:$D$20))","v":""},{"$f":"IF(H31=\"\",\"\",SUMIF($I$19:$I$20,$A31 & J$27,$D$19:$D$20))","v":""},{"$f":"IF(H31=\"\",\"\",SUMIF($I$19:$I$20,$A31 & K$27,$D$19:$D$20))","v":""},{"$f":"IF(H31=\"\",\"\",SUMIF($I$19:$I$20,$A31 & L$27,$D$19:$D$20))","v":""},{"$f":"IF(H31=\"\",\"\",SUMIF($I$19:$I$20,$A31 & M$27,$D$19:$D$20))","v":""}]
[null,"4. Run SBUH Model"]
[]
[]
[]
[null,"5. SCM Minimum Sizing Requirements"]
["SCM Name",null,"Min. Required Storage Vol. (ft3)","Depth Below Underdrain (ft)","Drain Time (hours)","Results are out of date."]
[null,null,null,null,null,"Click 'Launch Model' to update."]
["end_Output"]
[]
{"$rows_left_out":5}
{"sheet":"SBUH Model","index":1,"n_rows":741,"n_cols":16,"rows_kept":741,"cut":false,"hidden":false,"merged":[[18,4,18,5],[18,6,18,7],[18,8,18,9]]}
["SCM Hardpan"]
[]
["SBUH Parameters: ",null,null,null,null,null,null,null,null,null,null,null,"SCM Parameters: "]
[null,null,"Design rainfall depth (in) = ",{"$f":"'Project Information'!$D$10","v":2},null,null,null,null,null,null,null,null,null,"Plan area (ft2) = ",900]
[null,null,"Model time step (min) = ",{"$f":"A22-A21","v":10},null,null,null,null,null,null,null,null,null,"Sizing factor = ",{"$f":"O4/SUM(D8:D12)","v":8.1818181818181818E-2}]
[]
[null,null,"DMA Summary","Area (ft2)","CN","S","Weighting ",null,null,null,null,null,null,"Design infiltration rate (in/hr) = ",0.75]
[null,null,"New impervious area: ",11000,98,{"$f":"(1000/E8)-10","v":0.20408163265306101},1,null,null,null,null,null,null,"Safety factor = ",1]
[null,null,"Replaced impervious in USA: ",0,98,{"$f":"(1000/E9)-10","v":0.20408163265306101},0,null,null,null,null,null,null,"SCM Exfiltration rate (cfs) = ",{"$f":"O4*(O7/12/3600)","v":1.5625E-2}]
[null,null,"Replaced impervious not USA: ",0,98,{"$f":"(1000/E10)-10","v":0.20408163265306101},0.5,null,null,null,null,null,null,"Drainage time (hours) = ",{"$f":"(P165/O9)/3600","v":11.671327135719395}]
[null,null,"Landscape area: ",0,68,{"$f":"(1000/E11)-10","v":4.7058823529411757},1,null,null,null,null,null,null,"Minimum storage volume (ft3) = ",{"$f":"MAX(P21:P741)*O8*IF(O10>48,1.2,1)","v":770.67411508503574}]
[null,null,"Solid unit pavers set in sand: ",0,89,{"$f":"(1000/E12)-10","v":1.2359550561797761},1,null,null,null,null,null,null,"Gravel volume (ft3) = ",{"$f":"O11/'Lookups, Constants'!$F$3","v":1926.6852877125893}]
[null,null,"Non-runoff generating area: ",{"$f":"SUMIF('Project Information'!$H$19:H20,\"<69\",'Project Information'!$D$19:D20)","v":0},"N/A","N/A","N/A",null,null,null,null,null,null,"Gravel depth (ft) = ",{"$f":"O12/O4","v":2.1407614307917657}]
[]
[null,null,"Travel path length (ft) = ",{"$f":"SQRT(2*SUM(D8,D11:D13))","v":148.32396974191326},null,null,null,null,null,null,null,null,null,null,"% inflow that "]
[null,null,"Time of concentration (min) = ",{"$f":"MAX(5,60*0.007*(0.011*D15)^0.8/D4^0.5/0.005^0.4)","v":5},"(rain/runoff)",null,"(rain/runoff)",null,"(rain/runoff)",null,null,null,"runoff %","direct rain vol","is exfiltrated","(max/total vol.)"]
[null,null,null,null,{"$f":"MAX(E21:E741)/$D$4","v":0.88717751251443977},null,{"$f":"MAX(G21:G741)/$D$4","v":9.7238895558223348E-2},null,{"$f":"MAX(I21:I741)/$D$4","v":0.5139815831714114},null,null,null,{"$f":"SUM(M21:M741)/(($D$4/12)*SUM(D$8:D$12))","v":0.88717751251444021},{"$f":"SUM(N21:N741)","v":149.99999999999983},{"$f":"-SUM(O21:O741)/SUM(M21:N741)","v":0.99999999999999889},{"$f":"MAX(P21:P741)/SUM($M$21:$N$741)","v":0.43381792261400354}]
["SBUH Runoff Calculations",null,null,null,null,null,null,null,null,null,null,null,"Bioretention Hydraulics"]
[null,null,null,null,"Impervious",null,"Landscape",null,"Solid unit pavers set in sand"]
["Time (minutes)","Distribution \n(Type I)","Rainfall Depth (in)","Cumulative Rainfall (in)","Cumulative Runoff Depth (in)","Instantaneous Runoff (in)","Cumulative Runoff Depth (in)","Instantaneous Runoff (in)","Cumulative Runoff Depth (in)","Instantaneous Runoff (in)","Instantaneous Runoff Rate (cfs)","Routed Flow Rate (cfs)","Stormwater Inflow (ft3)","Direct Rain (ft3)","Exfiltration Outflow (ft3)","Bioretention Water Volume (ft3)"]
[0,0,{"$f":"$D$4*'SBUH Model'!B21","v":0},{"$f":"C21","v":0},{"$f":"IF(D21<0.2*F$8,0,(D21-0.2*F$8)^2/(D21+0.8*F$8))","v":0},0,{"$f":"IF(D21<0.2*F$11,0,(D21-0.2*F$11)^2/(D21+0.8*F$11))","v":0},0,{"$f":"IF(D21<0.2*F$12,0,(D21-0.2*F$12)^2/(D21+0.8*F$12))","v":0},0,{"$f":"((F21/12)*SUMPRODUCT(D$8:D$10,G$8:G$10)+(H21/12)*D$11+(J21/12)*D$12)/($D$5*60)","v":0},0,{"$f":"L21*($D$5*60)","v":0},{"$f":"(C21/12)*O$4","v":0},0,0]
[10,2.7000000000000001E-3,{"$f":"$D$4*'SBUH Model'!B22","v":5.4000000000000003E-3},{"$f":"C22+D21","v":5.4000000000000003E-3},{"$f":"IF(D22<0.2*F$8,0,(D22-0.2*F$8)^2/(D22+0.8*F$8))","v":0},{"$f":"MAX(0,E22-E21)","v":0},{"$f":"IF(D22<0.2*F$11,0,(D22-0.2*F$11)^2/(D22+0.8*F$11))","v":0},{"$f":"MAX(0,G22-G21)","v":0},{"$f":"IF(D22<0.2*F$12,0,(D22-0.2*F$12)^2/(D22+0.8*F$12))","v":0},{"$f":"MAX(0,I22-I21)","v":0},{"$f":"((F22/12)*SUMPRODUCT(D$8:D$10,G$8:G$10)+(H22/12)*D$11+(J22/12)*D$12)/($D$5*60)","v":0},{"$f":"MAX(0,L21+(D$5/(2*$D$16+D$5))*(K21+K22-2*L21))","v":0},0,0.40500000000000003,{"$f":"-MIN(O$9*D$5*60,SUM(M22,N22,P21))","v":-0.40500000000000003},{"$f":"P21+SUM(M22:O22)","v":0}]
[20,2.5999999999999999E-3,{"$f":"$D$4*'SBUH Model'!B23","v":5.1999999999999998E-3},1.06E-2,0,{"$f":"MAX(0,E23-E22)","v":0},0,0,0,0,{"$f":"((F23/12)*SUMPRODUCT(D$8:D$10,G$8:G$10)+(H23/12)*D$11+(J23/12)*D$12)/($D$5*60)","v":0},0,0,0.38999999999999996,-0.38999999999999996,{"$f":"P22+SUM(M23:O23)","v":0}]
[30,2.7000000000000001E-3,{"$f":"$D$4*'SBUH Model'!B24","v":5.4000000000000003E-3},1.6E-2,0,0,0,0,0,0,0,0,0,0.40500000000000003,-0.40500000000000003,0]
[40,2.9999999999999992E-3,{"$f":"$D$4*'SBUH Model'!B25","v":5.9999999999999984E-3},2.1999999999999999E-2,0,0,0,0,0,0,0,0,0,0.4499999999999999,-0.4499999999999999,0]
[50,3.0000000000000009E-3,{"$f":"$D$4*'SBUH Model'!B26","v":6.0000000000000019E-3},2.8000000000000001E-2,0,0,0,0,0,0,0,0,0,0.45000000000000012,-0.45000000000000012,0]
[60,3.0000000000000009E-3,{"$f":"$D$4*'SBUH Model'!B27","v":6.0000000000000019E-3},3.4000000000000002E-2,0,0,0,0,0,0,0,0,0,0.45000000000000012,-0.45000000000000012,0]
[70,2.9999999999999992E-3,{"$f":"$D$4*'SBUH Model'!B28","v":5.9999999999999984E-3},0.04,0,0,0,0,0,0,0,0,0,0.4499999999999999,-0.4499999999999999,0]
[80,2.9999999999999992E-3,{"$f":"$D$4*'SBUH Model'!B29","v":5.9999999999999984E-3},4.5999999999999999E-2,1.2840384837375753E-4,1.2840384837375753E-4,0,0,0,0,1.96172546126574E-4,9.8086273063286998E-5,5.88517638379722E-2,0.4499999999999999,-0.50885176383797215,0]
[90,2.9999999999999992E-3,{"$f":"$D$4*'SBUH Model'!B30","v":5.9999999999999984E-3},5.1999999999999998E-2,5.8102512905048676E-4,4.526212806767292E-4,0,0,0,0,6.9150473436722514E-4,4.4383864024689955E-4,0.26630318414813975,0.4499999999999999,-0.71630318414813965,0]
[100,3.0000000000000027E-3,{"$f":"$D$4*'SBUH Model'!B31","v":6.0000000000000053E-3},5.8000000000000003E-2,1.3345003745826017E-3,7.5347524553211491E-4,0,0,0,0,1.1511427362296198E-3,9.2132373529842245E-4,0.55279424117905351,0.4500000000000004,-1.0027942411790538,0]
[110,2.9999999999999992E-3,{"$f":"$D$4*'SBUH Model'!B32","v":5.9999999999999984E-3},6.4000000000000001E-2,2.365001172882956E-3,1.0305007983003544E-3,0,0,0,0,1.5743762196255414E-3,1.3627594779275806E-3,0.81765568675654832,0.4499999999999999,-1.2676556867565483,0]
[120,3.0000000000000027E-3,{"$f":"$D$4*'SBUH Model'!B33","v":6.0000000000000053E-3},7.0000000000000007E-2,3.6511507490135297E-3,1.2861495761305737E-3,0,0,0,0,1.9649507413105984E-3,1.7696634804680699E-3,1.061798088280842,0.4500000000000004,-1.5117980882808424,0]
[130,3.2999999999999974E-3,{"$f":"$D$4*'SBUH Model'!B34","v":6.5999999999999948E-3},7.6600000000000001E-2,5.3382930097865015E-3,1.6871422607729718E-3,0,0,0,0,2.5775784539587071E-3,2.271264597634653E-3,1.3627587585807919,0.49499999999999966,-1.8577587585807915,0]
[140,3.4000000000000002E-3,{"$f":"$D$4*'SBUH Model'!B35","v":6.8000000000000005E-3},8.3400000000000002E-2,7.3515374928619058E-3,2.0132444830754043E-3,0,0,0,0,3.0757901824763124E-3,2.8266843182175099E-3,1.6960105909305059,0.51,-2.2060105909305059,0]
[150,3.2999999999999974E-3,{"$f":"$D$4*'SBUH Model'!B36","v":6.5999999999999948E-3},0.09,9.5513821967143225E-3,2.1998447038524167E-3,0,0,0,0,3.360873853107859E-3,3.2183320177920855E-3,1.9309992106752514,0.49499999999999966,-2.425999210675251,0]
[160,3.3000000000000043E-3,{"$f":"$D$4*'SBUH Model'!B37","v":6.6000000000000086E-3},9.6600000000000005E-2,1.1974735189440748E-2,2.4233529927264255E-3,0,0,0,0,3.7023448499987053E-3,3.5316093515532819E-3,2.1189656109319692,0.49500000000000061,-2.6139656109319698,0]
[170,3.4000000000000002E-3,{"$f":"$D$4*'SBUH Model'!B38","v":6.8000000000000005E-3},0.10340000000000001,1.4687760631015328E-2,2.7130254415745798E-3,0,0,0,0,4.1448999801833863E-3,3.9236224150910456E-3,2.3541734490546276,0.51,-2.8641734490546273,0]
[180,3.2999999999999974E-3,{"$f":"$D$4*'SBUH Model'!B39","v":6.5999999999999948E-3},0.11,1.7515508070293121E-2,2.8277474392777932E-3,0,0,0,0,4.3201696988966285E-3,4.2325348395400074E-3,2.5395209037240045,0.49499999999999966,-3.0345209037240042,0]
[190,3.2999999999999974E-3,{"$f":"$D$4*'SBUH Model'!B40","v":6.5999999999999948E-3},0.1166,2.0521175861655382E-2,3.0056677913622605E-3,0,0,0,0,4.5919924590256764E-3,4.4560810789611525E-3,2.6736486473766914,0.49499999999999966,-3.1686486473766911,0]
{"$rows_left_out":702}
{"sheet":"SCS,SBUH Equations","index":2,"n_rows":724,"n_cols":16,"rows_kept":724,"cut":false,"hidden":false,"merged":[]}
["SCS Type I Distribution (10-min)",null,null,null,null,"SCS Type I Distribution (2-min)",null,null,null,null,"Stormwater Runoff and Routing Equations: "]
[]
["Step","Minute","Cummulative Distribution","Incremental Distribution",null,"Step","Minute","Cummulative Distribution","Incremental Distribution"]
[0,0,0,0,null,0,0,0,0,null,"Computing Runoff (SCS and SBUH are the same): "]
[1,10,2.7000000000000001E-3,{"$f":"C5-C4","v":2.7000000000000001E-3},null,1,2,5.0000000000000001E-4,{"$f":"H5-H4","v":5.0000000000000001E-4}]
[2,20,5.3E-3,{"$f":"C6-C5","v":2.5999999999999999E-3},null,2,4,1.1000000000000001E-3,{"$f":"H6-H5","v":6.0000000000000006E-4}]
[3,30,8.0000000000000002E-3,2.7000000000000001E-3,null,3,6,1.6000000000000001E-3,5.0000000000000001E-4,null,null,null,null,"where: "]
[4,40,1.0999999999999999E-2,2.9999999999999992E-3,null,4,8,2.0999999999999999E-3,4.9999999999999979E-4,null,null,null,null,"R = runoff (in)"]
[5,50,1.4E-2,3.0000000000000009E-3,null,5,10,2.7000000000000001E-3,6.0000000000000027E-4,null,null,null,null,"P = rainfall (in)"]
[6,60,1.7000000000000001E-2,3.0000000000000009E-3,null,6,12,3.2000000000000002E-3,5.0000000000000001E-4,null,null,null,null,"Ia = initial abstraction (in)"]
[7,70,0.02,2.9999999999999992E-3,null,7,14,3.7000000000000002E-3,5.0000000000000001E-4,null,null,null,null,"S = potential maximum soil moisture retention after runoff begins (in)"]
[8,80,2.3E-2,2.9999999999999992E-3,null,8,16,4.3E-3,5.9999999999999984E-4,null,null,null,null,"CN = runoff curve number"]
[9,90,2.5999999999999999E-2,2.9999999999999992E-3,null,9,18,4.7999999999999996E-3,4.9999999999999958E-4]
[10,100,2.9000000000000001E-2,3.0000000000000027E-3,null,10,20,5.3E-3,5.0000000000000044E-4]
[11,110,3.2000000000000001E-2,2.9999999999999992E-3,null,11,22,5.8999999999999999E-3,5.9999999999999984E-4]
[12,120,3.5000000000000003E-2,3.0000000000000027E-3,null,12,24,6.4000000000000003E-3,5.0000000000000044E-4]
[13,130,3.8300000000000001E-2,3.2999999999999974E-3,null,13,26,6.8999999999999999E-3,4.9999999999999958E-4]
[14,140,4.1700000000000001E-2,3.4000000000000002E-3,null,14,28,7.4999999999999997E-3,5.9999999999999984E-4,null,"SBUH Runoff Routing: "]
[15,150,4.4999999999999998E-2,3.2999999999999974E-3,null,15,30,8.0000000000000002E-3,5.0000000000000044E-4]
[16,160,4.8300000000000003E-2,3.3000000000000043E-3,null,16,32,8.6E-3,5.9999999999999984E-4,null,null,null,null,null,null,"where: "]
[17,170,5.1700000000000003E-2,3.4000000000000002E-3,null,17,34,9.1999999999999998E-3,5.9999999999999984E-4,null,null,null,null,null,null,"It = instantaneous hydrograph (cfs)"]
[18,180,5.5E-2,3.2999999999999974E-3,null,18,36,9.7999999999999997E-3,5.9999999999999984E-4,null,null,null,null,null,null,"Rt = runoff for current time step (in)"]
[19,190,5.8299999999999998E-2,3.2999999999999974E-3,null,19,38,1.04E-2,5.9999999999999984E-4,null,null,null,null,null,null,"A = contributing area (ft)"]
[20,200,6.1699999999999998E-2,3.4000000000000002E-3,null,20,40,1.0999999999999999E-2,5.9999999999999984E-4,null,null,null,null,null,null,"dt = calculation time step (min)"]
[21,210,6.5000000000000002E-2,3.3000000000000043E-3,null,21,42,1.1599999999999999E-2,5.9999999999999984E-4]
[22,220,6.8699999999999997E-2,3.699999999999995E-3,null,22,44,1.2200000000000001E-2,6.0000000000000157E-4,null,null,null,null,null,null,"Qt = routed stormwater flow"]
[23,230,7.2300000000000003E-2,3.600000000000006E-3,null,23,46,1.2800000000000001E-2,5.9999999999999984E-4,null,null,null,null,null,null,"w = routing function"]
[24,240,7.5999999999999998E-2,3.699999999999995E-3,null,24,48,1.34E-2,5.9999999999999984E-4,null,null,null,null,null,null,"Tc = time of concentration"]
[25,250,7.9699999999999993E-2,3.699999999999995E-3,null,25,50,1.4E-2,5.9999999999999984E-4]
[26,260,8.3299999999999999E-2,3.600000000000006E-3,null,26,52,1.46E-2,5.9999999999999984E-4,null,null,null,null,null,null,"n = Manning's roughness (0.011 for pavement)"]
[27,270,8.6999999999999994E-2,3.699999999999995E-3,null,27,54,1.52E-2,5.9999999999999984E-4,null,null,null,null,null,null,"L = flow lenth (ft; computed from tributary area)"]
[28,280,9.0999999999999998E-2,4.0000000000000036E-3,null,28,56,1.5800000000000002E-2,6.0000000000000157E-4,null,null,null,null,null,null,"P2 = 2-year, 24-hour rainfall (in)"]
[29,290,9.5000000000000001E-2,4.0000000000000036E-3,null,29,58,1.6400000000000001E-2,5.9999999999999984E-4,null,null,null,null,null,null,"s = 0.005 (ft/ft; assumed value)"]
[30,300,9.9000000000000005E-2,4.0000000000000036E-3,null,30,60,1.7000000000000001E-2,5.9999999999999984E-4,null,null,null,null,null,null,"Note: set minimum Tc = 5 minutes (Portland BES recommendation)"]
[31,310,0.1033,4.2999999999999983E-3,null,31,62,1.7600000000000001E-2,5.9999999999999984E-4]
[32,320,0.1077,4.4000000000000011E-3,null,32,64,1.8200000000000001E-2,5.9999999999999984E-4]
[33,330,0.112,4.2999999999999983E-3,null,33,66,1.8800000000000001E-2,5.9999999999999984E-4,null,"from TR-55 user manual… "]
[34,340,0.1163,4.2999999999999983E-3,null,34,68,1.9400000000000001E-2,5.9999999999999984E-4]
[35,350,0.1207,4.4000000000000011E-3,null,35,70,0.02,5.9999999999999984E-4]
[36,360,0.125,4.2999999999999983E-3,null,36,72,2.06E-2,5.9999999999999984E-4]
{"$rows_left_out":685}
{"sheet":"Lookups, Constants","index":3,"n_rows":45,"n_cols":6,"rows_kept":45,"cut":false,"hidden":false,"merged":[[0,3,0,5]]}
["Lookup Tables for Combo Boxes",null,null,"Hydraulic Constants"]
[]
["DMA Type","Code",null,null,"Gravel layer porosity: ",0.4]
["Self-Treating","STA"]
["Self-Retaining","SRA"]
["Drains to SCM","2SCM"]
["Drains to Self-Retaining","2SRA"]
[]
["SCM Type"]
["Bioretention"]
["Direct Infiltration"]
[]
["DMA Surface Types","Curve Number","Runoff Factor (WQ)"]
["Roof",98,0.9]
["Concrete or asphalt",98,0.9]
["Grouted unit pavers",98,0.9]
["Pervious concrete",null,0]
["Porous asphalt",null,0]
["Unit pavers set in sand",89,0.2]
["Open/porous pavers",null,0]
["Crushed aggregate",null,0]
["Turfblock",null,0]
["Landscape",68,0.1]
[]
["SCM Optimization"]
["Area"]
["Depth"]
[]
["USA Lookup"]
["Yes"]
["No"]
[]
["Compliance Approach"]
["Tier 2 - Treatment"]
["Tier 3 - Retention"]
[]
["Infiltration Rate"]
["HSG A/B"]
["HSG C/D"]
["Site-Specific"]
{"$rows_left_out":5}